BDBM50301433 4-(4-Fluoro-phenyl)-2-{4-[4-(2-methyl-1H-indol-3-yl)-piperidin-1-yl]-butyl}-5,6,7,8-tetrahydro-pyrido[1,2-c]pyrimidine-1,3-dione::CHEMBL566595
SMILES Cc1[nH]c2ccccc2c1C1CCN(CCCCn2c(=O)c(-c3ccc(F)cc3)c3CCCCn3c2=O)CC1
InChI Key InChIKey=GLFGCJCRFFGZER-UHFFFAOYSA-N
Data  4 KI
  Tab Delimited (TSV)   2D SDfile   Computed 3D by Vconf -m prep SDfile
Find this compound or compounds like it in BindingDB:
Activity Spreadsheet -- Enzyme Inhibition Constant Data from BindingDB
Found 4 hits for monomerid = 50301433
Target5-hydroxytryptamine receptor 1A(Rattus norvegicus (rat))
Medical University Of Warsaw
Curated by ChEMBL
LigandPNGBDBM50301433(4-(4-Fluoro-phenyl)-2-{4-[4-(2-methyl-1H-indol-3-y...)
Affinity DataKi:  114nM. Assay description: Displacement of [3H]8-OH-DPAT from 5-HT1A receptor in rat hippocampus
In DepthDetails ArticlePubMed
TargetSodium-dependent serotonin transporter(Rattus norvegicus (rat))
Medical University Of Warsaw
Curated by ChEMBL
LigandPNGBDBM50301433(4-(4-Fluoro-phenyl)-2-{4-[4-(2-methyl-1H-indol-3-y...)
Affinity DataKi:  116nM. Assay description: Displacement of [3H]citalopram from SERT in rat cerebral cortex by liquid scintillation counting
In DepthDetails ArticlePubMed
TargetSodium-dependent serotonin transporter(Rattus norvegicus (rat))
Medical University Of Warsaw
Curated by ChEMBL
LigandPNGBDBM50301433(4-(4-Fluoro-phenyl)-2-{4-[4-(2-methyl-1H-indol-3-y...)
Affinity DataKi:  147nM. Assay description: Displacement of [3H]citalopram from SERT in rat cerebral cortex by liquid scintillation counting
In DepthDetails ArticlePubMed
Target5-hydroxytryptamine receptor 1A(Rattus norvegicus (rat))
Medical University Of Warsaw
Curated by ChEMBL
LigandPNGBDBM50301433(4-(4-Fluoro-phenyl)-2-{4-[4-(2-methyl-1H-indol-3-y...)
Affinity DataKi:  3.20E+3nM. Assay description: Displacement of [3H]8-OH-DPAT from 5-HT1A receptor in rat hippocampus
In DepthDetails ArticlePubMed