BDBM50301511 1-(4-chlorophenyl)-3-(3-(1-methyl-1H-pyrazol-5-yl)-4-(2-(pyrrolidin-1-yl)ethoxy)phenyl)urea::CHEMBL569510
SMILES Cn1nccc1-c1cc(NC(=O)Nc2ccc(Cl)cc2)ccc1OCCN1CCCC1
InChI Key InChIKey=GJXJIFCLKKBEAW-UHFFFAOYSA-N
Data  2 KI
  Tab Delimited (TSV)   2D SDfile   Computed 3D by Vconf -m prep SDfile
Find this compound or compounds like it in BindingDB:
Activity Spreadsheet -- Enzyme Inhibition Constant Data from BindingDB
Found 2 hits for monomerid = 50301511
Target5-hydroxytryptamine receptor 2A(Homo sapiens (Human))
Arena Pharmaceuticals
Curated by ChEMBL
LigandPNGBDBM50301511(1-(4-chlorophenyl)-3-(3-(1-methyl-1H-pyrazol-5-yl)...)
Affinity DataKi:  0.150nM. Assay description: Displacement of [125I]DOI from 5HT2A receptor expressed in HEK cells
In DepthDetails ArticlePubMed
Target5-hydroxytryptamine receptor 2C(Homo sapiens (Human))
Arena Pharmaceuticals
Curated by ChEMBL
LigandPNGBDBM50301511(1-(4-chlorophenyl)-3-(3-(1-methyl-1H-pyrazol-5-yl)...)
Affinity DataKi:  9nM. Assay description: Binding affinity to 5HT2C receptor expressed in HEK cells
In DepthDetails ArticlePubMed