BDBM50301526 CHEMBL576043::N-methyl-N-(4-(pyridin-4-yl)thiazol-2-yl)-4-(trifluoromethoxy)benzamide
SMILES CN(C(=O)c1ccc(OC(F)(F)F)cc1)c1nc(cs1)-c1ccncc1
InChI Key InChIKey=SSRKNFYHFNHSFG-UHFFFAOYSA-N
Data  1 IC50
  Tab Delimited (TSV)   2D SDfile   Computed 3D by Vconf -m prep SDfile
Find this compound or compounds like it in BindingDB:
Activity Spreadsheet -- Enzyme Inhibition Constant Data from BindingDB
Found 1 hit for monomerid = 50301526
TargetMetabotropic glutamate receptor 1(Homo sapiens (Human))
Tsukuba Research Institute
Curated by ChEMBL
LigandPNGBDBM50301526(CHEMBL576043 | N-methyl-N-(4-(pyridin-4-yl)thiazol...)
Affinity DataIC50: >1.00E+4nM. Assay description: Antagonist activity at human mGluR1 receptor expressed in CHO cells by FLIPR assay
In DepthDetails ArticlePubMed