BDBM50301760 CHEMBL578756::isopropyl 2-cyano-4,4-dimethyl-6-(thiophene-2-carbonyl)-1,4,5,6-tetrahydropyrrolo[3,2-d]azepine-8-carboxylate
SMILES CC(C)OC(=O)C1=CN(CC(C)(C)c2cc([nH]c12)C#N)C(=O)c1cccs1
InChI Key InChIKey=JIRVCGUFWISTBB-UHFFFAOYSA-N
Data  1 EC50
  Tab Delimited (TSV)   2D SDfile   Computed 3D by Vconf -m prep SDfile
Find this compound or compounds like it in BindingDB:
Activity Spreadsheet -- Enzyme Inhibition Constant Data from BindingDB
Found 1 hit for monomerid = 50301760
TargetBile acid receptor(Homo sapiens (Human))
Wyeth Research
Curated by ChEMBL
LigandPNGBDBM50301760(CHEMBL578756 | isopropyl 2-cyano-4,4-dimethyl-6-(t...)
Affinity DataEC50:  16nM. Assay description: Agonist activity at gal4-tagged human FXR-ligand binding domain expressed in human HEK293 cells by luciferase reporter gene assay
In DepthDetails ArticlePubMed