BDBM50301819 3-(5-methyl-4-(naphthalen-2-yl)-1H-1,2,3-triazol-1-yl)pyridine::CHEMBL567584
SMILES Cc1c(nnn1-c1cccnc1)-c1ccc2ccccc2c1
InChI Key InChIKey=CDMACXOEZRVPAK-UHFFFAOYSA-N
Data  1 IC50
  Tab Delimited (TSV)   2D SDfile   Computed 3D by Vconf -m prep SDfile
Find this compound or compounds like it in BindingDB:
Activity Spreadsheet -- Enzyme Inhibition Constant Data from BindingDB
Found 1 hit for monomerid = 50301819
TargetMetabotropic glutamate receptor 1(Homo sapiens (Human))
Tsukuba Research Institute
Curated by ChEMBL
LigandPNGBDBM50301819(3-(5-methyl-4-(naphthalen-2-yl)-1H-1,2,3-triazol-1...)
Affinity DataIC50:  300nM. Assay description: Antagonist activity at human mGluR1 receptor expressed in CHO cell membranes assessed as inhibition of L-glutamate-induced calcium mobilization by FL...
In DepthDetails ArticlePubMed