BDBM50301820 2-methyl-5-(5-methyl-1-(pyridin-3-yl)-1H-1,2,3-triazol-4-yl)benzo[d]thiazole::CHEMBL576231
SMILES Cc1nc2cc(ccc2s1)-c1nnn(c1C)-c1cccnc1
InChI Key InChIKey=TUMXYGIWQHAHFZ-UHFFFAOYSA-N
Data  1 IC50
  Tab Delimited (TSV)   2D SDfile   Computed 3D by Vconf -m prep SDfile
Find this compound or compounds like it in BindingDB:
Activity Spreadsheet -- Enzyme Inhibition Constant Data from BindingDB
Found 1 hit for monomerid = 50301820
TargetMetabotropic glutamate receptor 1(Homo sapiens (Human))
Tsukuba Research Institute
Curated by ChEMBL
LigandPNGBDBM50301820(2-methyl-5-(5-methyl-1-(pyridin-3-yl)-1H-1,2,3-tri...)
Affinity DataIC50:  1.50E+3nM. Assay description: Antagonist activity at human mGluR1 receptor expressed in CHO cell membranes assessed as inhibition of L-glutamate-induced calcium mobilization by FL...
In DepthDetails ArticlePubMed