BDBM50301887 CHEMBL568223::N-(4-(trifluoromethyl)phenyl)benzo[d]isothiazol-3-amine
SMILES FC(F)(F)c1ccc(Nc2nsc3ccccc23)cc1
InChI Key InChIKey=YGBMOGGXSOVXLF-UHFFFAOYSA-N
Data  1 IC50
  Tab Delimited (TSV)   2D SDfile   Computed 3D by Vconf -m prep SDfile
Find this compound or compounds like it in BindingDB:
Activity Spreadsheet -- Enzyme Inhibition Constant Data from BindingDB
Found 1 hit for monomerid = 50301887
TargetBifunctional epoxide hydrolase 2(Homo sapiens (Human))
Merck Research Laboratories
Curated by ChEMBL
LigandPNGBDBM50301887(CHEMBL568223 | N-(4-(trifluoromethyl)phenyl)benzo[...)
Affinity DataIC50:  2.50E+3nM. Assay description: Inhibition of human sEH
In DepthDetails ArticlePubMed