BDBM50301981 2-(6-(3'-(aminomethyl)biphenyl-3-yloxy)-3,5-difluoropyridin-2-yloxy)benzoic acid::CHEMBL572040
SMILES NCc1cccc(c1)-c1cccc(Oc2nc(Oc3ccccc3C(O)=O)c(F)cc2F)c1
InChI Key InChIKey=WPRNQUHXHQVUKI-UHFFFAOYSA-N
Data  3 IC50
  Tab Delimited (TSV)   2D SDfile   Computed 3D by Vconf -m prep SDfile
Find this compound or compounds like it in BindingDB:
Activity Spreadsheet -- Enzyme Inhibition Constant Data from BindingDB
Found 3 hits for monomerid = 50301981
TargetPlasminogen(Homo sapiens (Human))
Berlex Biosciences
Curated by ChEMBL
LigandPNGBDBM50301981(2-(6-(3'-(aminomethyl)biphenyl-3-yloxy)-3,5-difluo...)
Affinity DataIC50:  2.10E+4nM. Assay description: Inhibition of plasmin
In DepthDetails ArticlePubMed
TargetUrokinase-type plasminogen activator(Homo sapiens (Human))
Berlex Biosciences
Curated by ChEMBL
LigandPNGBDBM50301981(2-(6-(3'-(aminomethyl)biphenyl-3-yloxy)-3,5-difluo...)
Affinity DataIC50:  840nM. Assay description: Inhibition of uPA
In DepthDetails ArticlePubMed
TargetTissue-type plasminogen activator(Homo sapiens (Human))
Berlex Biosciences
Curated by ChEMBL
LigandPNGBDBM50301981(2-(6-(3'-(aminomethyl)biphenyl-3-yloxy)-3,5-difluo...)
Affinity DataIC50: >3.00E+4nM. Assay description: Inhibition of tPA
In DepthDetails ArticlePubMed