BDBM50302316 (R)-N-cyclobutyl-N-(pyrrolidin-3-yl)-2-naphthamide::CHEMBL568372
SMILES O=C(N(C1CCC1)[C@@H]1CCNC1)c1ccc2ccccc2c1
InChI Key InChIKey=IMHRUEORWKDPGA-GOSISDBHSA-N
Data  3 IC50
  Tab Delimited (TSV)   2D SDfile   Computed 3D by Vconf -m prep SDfile
Find this compound or compounds like it in BindingDB:
Activity Spreadsheet -- Enzyme Inhibition Constant Data from BindingDB
Found 3 hits for monomerid = 50302316
TargetSodium-dependent serotonin transporter(Homo sapiens (Human))
Pfizer
Curated by ChEMBL
LigandPNGBDBM50302316((R)-N-cyclobutyl-N-(pyrrolidin-3-yl)-2-naphthamide...)
Affinity DataIC50:  9nM. Assay description: Inhibition of serotonin reuptake at human serotonin transporter expressed in HEK293 cells after 5 mins by scintillation counting
In DepthDetails ArticlePubMed
TargetSodium-dependent dopamine transporter(Homo sapiens (Human))
Pfizer
Curated by ChEMBL
LigandPNGBDBM50302316((R)-N-cyclobutyl-N-(pyrrolidin-3-yl)-2-naphthamide...)
Affinity DataIC50:  5.80E+3nM. Assay description: Inhibition of dopamine reuptake at human dopamine transporter expressed in HEK293 cells after 5 mins by scintillation counting
In DepthDetails ArticlePubMed
TargetSodium-dependent noradrenaline transporter(Homo sapiens (Human))
Pfizer
Curated by ChEMBL
LigandPNGBDBM50302316((R)-N-cyclobutyl-N-(pyrrolidin-3-yl)-2-naphthamide...)
Affinity DataIC50:  6.00E+3nM. Assay description: Inhibition of noradrenaline reuptake at human noradrenaline transporter expressed in HEK293 cells after 15 mins by scintillation counting
In DepthDetails ArticlePubMed