BDBM50302552 CHEMBL578166::N-((cis)-4-(4-(dimethylamino)-6-methylpyrimidin-2-ylamino)cyclohexyl)-3,4-difluorobenzamide
SMILES CN(C)c1cc(C)nc(N[C@@H]2CC[C@@H](CC2)NC(=O)c2ccc(F)c(F)c2)n1
InChI Key InChIKey=AFFQHADHKVBBKI-GASCZTMLSA-N
Data  1 IC50
  Tab Delimited (TSV)   2D SDfile   Computed 3D by Vconf -m prep SDfile
Find this compound or compounds like it in BindingDB:
Activity Spreadsheet -- Enzyme Inhibition Constant Data from BindingDB
Found 1 hit for monomerid = 50302552
TargetMelanin-concentrating hormone receptor 1(Homo sapiens (Human))
Arena Pharmaceuticals
Curated by ChEMBL
LigandPNGBDBM50302552(CHEMBL578166 | N-((cis)-4-(4-(dimethylamino)-6-met...)
Affinity DataIC50:  2.5nM. Assay description: Antagonist activity at CART form of human MCH1 receptor expressed in HEK293 cells coexpressing Galphaq assessed as inhibition of MCH-induced intracel...
In DepthDetails ArticlePubMed