BDBM50302568 CHEMBL566075::N-[(cis-4-{[4-(Dimethylamino)-5-methylpyrimidin-2-yl]amino}cyclohexyl)methyl]-3,5-bis(trifluoromethyl)benzamide
SMILES CN(C)c1nc(N[C@@H]2CC[C@H](CNC(=O)c3cc(cc(c3)C(F)(F)F)C(F)(F)F)CC2)ncc1C
InChI Key InChIKey=OOUPDYBXVFKJRL-UJKQEGAGSA-N
Data  6 IC50
  Tab Delimited (TSV)   2D SDfile   Computed 3D by Vconf -m prep SDfile
Find this compound or compounds like it in BindingDB:
Activity Spreadsheet -- Enzyme Inhibition Constant Data from BindingDB
Found 6 hits for monomerid = 50302568
TargetMelanin-concentrating hormone receptor 1(Homo sapiens (Human))
Arena Pharmaceuticals
Curated by ChEMBL
LigandPNGBDBM50302568(CHEMBL566075 | N-[(cis-4-{[4-(Dimethylamino)-5-met...)
Affinity DataIC50:  5nM. Assay description: Antagonist activity at CART form of human MCH1 receptor expressed in HEK293 cells coexpressing Galphaq assessed as inhibition of MCH-induced intracel...
In DepthDetails ArticlePubMed
Target5-hydroxytryptamine receptor 2B(Homo sapiens (Human))
Arena Pharmaceuticals
Curated by ChEMBL
LigandPNGBDBM50302568(CHEMBL566075 | N-[(cis-4-{[4-(Dimethylamino)-5-met...)
Affinity DataIC50:  3.10E+3nM. Assay description: Displacement of [3H]rauwolsine from human 5HT2B receptor
In DepthDetails ArticlePubMed
Target5-hydroxytryptamine receptor 1A(Homo sapiens (Human))
Arena Pharmaceuticals
Curated by ChEMBL
LigandPNGBDBM50302568(CHEMBL566075 | N-[(cis-4-{[4-(Dimethylamino)-5-met...)
Affinity DataIC50:  4.80E+3nM. Assay description: Inhibition of human 5HT1A
In DepthDetails ArticlePubMed
TargetAlpha-1A adrenergic receptor(Homo sapiens (Human))
Arena Pharmaceuticals
Curated by ChEMBL
LigandPNGBDBM50302568(CHEMBL566075 | N-[(cis-4-{[4-(Dimethylamino)-5-met...)
Affinity DataIC50:  3.20E+3nM. Assay description: Displacement of [3H]prazosin from human adrenergic alpha1A receptor
In DepthDetails ArticlePubMed
TargetHistamine H1 receptor(Homo sapiens (Human))
Arena Pharmaceuticals
Curated by ChEMBL
LigandPNGBDBM50302568(CHEMBL566075 | N-[(cis-4-{[4-(Dimethylamino)-5-met...)
Affinity DataIC50: >1.00E+4nM. Assay description: Displacement of [3H]pyrilamine from human histamine H1 receptor
In DepthDetails ArticlePubMed
TargetAlpha-2A adrenergic receptor(Homo sapiens (Human))
Arena Pharmaceuticals
Curated by ChEMBL
LigandPNGBDBM50302568(CHEMBL566075 | N-[(cis-4-{[4-(Dimethylamino)-5-met...)
Affinity DataIC50:  310nM. Assay description: Displacement of [3H]MK-912 from human adrenergic alpha2A receptor
In DepthDetails ArticlePubMed