BDBM50302659 (S)-4-(4-(2-methoxyethylamino)-6-phenylpyrimidine-2-carboxamido)-5-oxo-5-(4-(pentyloxycarbonyl)piperazin-1-yl)pentanoic acid::CHEMBL568257
SMILES CCCCCOC(=O)N1CCN(CC1)C(=O)[C@H](CCC(O)=O)NC(=O)c1nc(NCCOC)cc(n1)-c1ccccc1
InChI Key InChIKey=YBSDQGBRPKMWQR-QFIPXVFZSA-N
Data  1 KI  1 IC50
  Tab Delimited (TSV)   2D SDfile   Computed 3D by Vconf -m prep SDfile
Find this compound or compounds like it in BindingDB:
Activity Spreadsheet -- Enzyme Inhibition Constant Data from BindingDB
Found 2 hits for monomerid = 50302659
TargetP2Y purinoceptor 12(Homo sapiens (Human))
Pfizer
Curated by ChEMBL
LigandPNGBDBM50302659((S)-4-(4-(2-methoxyethylamino)-6-phenylpyrimidine-...)
Affinity DataKi:  5.20nM. Assay description: Binding affinity at human recombinant P2Y12 receptor expressed in CHO cells by radioligand binding assay
In DepthDetails ArticlePubMed
TargetP2Y purinoceptor 12(Homo sapiens (Human))
Pfizer
Curated by ChEMBL
LigandPNGBDBM50302659((S)-4-(4-(2-methoxyethylamino)-6-phenylpyrimidine-...)
Affinity DataIC50: >1.00E+4nM. Assay description: Antagonist activity at P2Y12 receptor in human platelet rich plasma assessed as inhibition of ADP-induced platelet aggregation by light transmission ...
In DepthDetails ArticlePubMed