BDBM50302737 (2R,3S,4S,5R,6S)-2-(acetoxymethyl)-6-((2R,3R,4S,5R,6S)-4,5-diacetoxy-2-(acetoxymethyl)-6-(4-((hydroxyimino)methyl)phenoxy)tetrahydro-2H-pyran-3-yloxy)tetrahydro-2H-pyran-3,4,5-triyl triacetate::CHEMBL577106
SMILES CC(=O)OC[C@H]1O[C@@H](Oc2ccc(CN=O)cc2)[C@H](OC(C)=O)[C@@H](OC(C)=O)[C@@H]1O[C@@H]1O[C@H](COC(C)=O)[C@H](OC(C)=O)[C@H](OC(C)=O)[C@H]1OC(C)=O
InChI Key InChIKey=XLTYUZXJBFOWLP-LZWHNZSHSA-N
Data  1 IC50
  Tab Delimited (TSV)   2D SDfile   Computed 3D by Vconf -m prep SDfile
Find this compound or compounds like it in BindingDB:
Activity Spreadsheet -- Enzyme Inhibition Constant Data from BindingDB
Found 1 hit for monomerid = 50302737
TargetPolyphenol oxidase 2(Agaricus bisporus (Common mushroom))
Sun Yat-Sen University
Curated by ChEMBL
LigandPNGBDBM50302737((2R,3S,4S,5R,6S)-2-(acetoxymethyl)-6-((2R,3R,4S,5R...)
Affinity DataIC50: >2.00E+5nM. Assay description: Inhibition of mushroom tyrosinase
In DepthDetails ArticlePubMed