BDBM50303043 (S)-3-(1-(5-fluoropyridin-2-yl)ethylamino)-6-methyl-5-(5-methyl-1H-pyrazol-3-ylamino)pyrazine-2-carbonitrile::CHEMBL578201
SMILES C[C@H](Nc1nc(Nc2cc(C)n[nH]2)c(C)nc1C#N)c1ccc(F)cn1
InChI Key InChIKey=FLYNZEXUURBXAW-JTQLQIEISA-N
Data  9 IC50  1 EC50
  Tab Delimited (TSV)   2D SDfile   Computed 3D by Vconf -m prep SDfile
Find this compound or compounds like it in BindingDB:
Activity Spreadsheet -- Enzyme Inhibition Constant Data from BindingDB
Found 10 hits for monomerid = 50303043
TargetTyrosine-protein kinase JAK2(Homo sapiens (Human))
Astrazeneca R&D Boston
Curated by ChEMBL
LigandPNGBDBM50303043((S)-3-(1-(5-fluoropyridin-2-yl)ethylamino)-6-methy...)
Affinity DataIC50:  11nM. Assay description: Inhibition of JAK2 using 5 mM ATP as a substrate
In DepthDetails ArticlePubMed
TargetTyrosine-protein kinase JAK2(Homo sapiens (Human))
Astrazeneca R&D Boston
Curated by ChEMBL
LigandPNGBDBM50303043((S)-3-(1-(5-fluoropyridin-2-yl)ethylamino)-6-methy...)
Affinity DataIC50: <3nM. Assay description: Inhibition of JAK2 using 2 mM ATP as a substrate
In DepthDetails ArticlePubMed
TargetTyrosine-protein kinase JAK3(Homo sapiens (Human))
Astrazeneca R&D Boston
Curated by ChEMBL
LigandPNGBDBM50303043((S)-3-(1-(5-fluoropyridin-2-yl)ethylamino)-6-methy...)
Affinity DataIC50:  1.57E+4nM. Assay description: Inhibition of JAK3 using 5 mM ATP as a substrate
In DepthDetails ArticlePubMed
TargetTyrosine-protein kinase JAK2(Homo sapiens (Human))
Astrazeneca R&D Boston
Curated by ChEMBL
LigandPNGBDBM50303043((S)-3-(1-(5-fluoropyridin-2-yl)ethylamino)-6-methy...)
Affinity DataIC50:  47nM. Assay description: Inhibition of JAK2 using 5 mM ATP as a substrate
In DepthDetails ArticlePubMed
TargetTyrosine-protein kinase JAK3(Homo sapiens (Human))
Astrazeneca R&D Boston
Curated by ChEMBL
LigandPNGBDBM50303043((S)-3-(1-(5-fluoropyridin-2-yl)ethylamino)-6-methy...)
Affinity DataIC50:  2.51E+4nM. Assay description: Inhibition of JAK3 using 5 mM ATP as a substrate
In DepthDetails ArticlePubMed
TargetSignal transducer and activator of transcription 5B(Homo sapiens (Human))
Astrazeneca R&D Boston
Curated by ChEMBL
LigandPNGBDBM50303043((S)-3-(1-(5-fluoropyridin-2-yl)ethylamino)-6-methy...)
Affinity DataEC50:  20nM. Assay description: Inhibition of erythropoietin-stimulated STAT5 expressed in human U2OS cells
In DepthDetails ArticlePubMed
TargetCyclin-dependent kinase 2(Homo sapiens (Human))
Astrazeneca R&D Boston
Curated by ChEMBL
LigandPNGBDBM50303043((S)-3-(1-(5-fluoropyridin-2-yl)ethylamino)-6-methy...)
Affinity DataIC50:  460nM. Assay description: Inhibition of CDK2
In DepthDetails ArticlePubMed
TargetHigh affinity nerve growth factor receptor(Homo sapiens (Human))
Astrazeneca R&D Boston
Curated by ChEMBL
LigandPNGBDBM50303043((S)-3-(1-(5-fluoropyridin-2-yl)ethylamino)-6-methy...)
Affinity DataIC50:  580nM. Assay description: Inhibition of TRKA
In DepthDetails ArticlePubMed
TargetTyrosine-protein kinase JAK2(Homo sapiens (Human))
Astrazeneca R&D Boston
Curated by ChEMBL
LigandPNGBDBM50303043((S)-3-(1-(5-fluoropyridin-2-yl)ethylamino)-6-methy...)
Affinity DataIC50: <3nM. Assay description: Inhibition of JAK2 using 2 mM ATP as a substrate
In DepthDetails ArticlePubMed
TargetAurora kinase B(Homo sapiens (Human))
Astrazeneca R&D Boston
Curated by ChEMBL
LigandPNGBDBM50303043((S)-3-(1-(5-fluoropyridin-2-yl)ethylamino)-6-methy...)
Affinity DataIC50:  270nM. Assay description: Inhibition of Aurora B
In DepthDetails ArticlePubMed