BDBM50303142 CHEMBL571615::Kadsurenin C
SMILES COc1ccc(cc1OC)[C@@H]1[C@@H](C)[C@]2(OC)C=C(CC=C)C(=O)[C@@H]1[C@@H]2O
InChI Key InChIKey=YYEUHNBQISBESB-LOPMHCFQSA-N
Data  2 IC50
  Tab Delimited (TSV)   2D SDfile   Computed 3D by Vconf -m prep SDfile
Find this compound or compounds like it in BindingDB:
Activity Spreadsheet -- Enzyme Inhibition Constant Data from BindingDB
Found 2 hits for monomerid = 50303142
TargetProstaglandin G/H synthase 2(Ovis aries (Sheep))
Universidad Nacional De Colombia
Curated by ChEMBL
LigandPNGBDBM50303142(CHEMBL571615 | Kadsurenin C)
Affinity DataIC50:  3.12E+5nM. Assay description: Inhibition of ovine COX-2 assessed as inhibition of transformation of AA to PGH2 by EIA
In DepthDetails ArticlePubMed
TargetProstaglandin G/H synthase 1(Ovis aries (Sheep))
Universidad Nacional De Colombia
Curated by ChEMBL
LigandPNGBDBM50303142(CHEMBL571615 | Kadsurenin C)
Affinity DataIC50:  3.87E+4nM. Assay description: Inhibition of ovine COX-1 assessed as inhibition of transformation of AA to PGH2 by EIA
In DepthDetails ArticlePubMed