BDBM50303145 2'-epi-guianin::CHEMBL570978
SMILES C[C@@H]1[C@H](C2[C@H](O)[C@@]1(CC=C)C=C(CC=C)C2=O)c1ccc2OCOc2c1
InChI Key InChIKey=IELYWLBCFOCUNW-KUXMWZRESA-N
Data  2 IC50
  Tab Delimited (TSV)   2D SDfile   Computed 3D by Vconf -m prep SDfile
Find this compound or compounds like it in BindingDB:
Activity Spreadsheet -- Enzyme Inhibition Constant Data from BindingDB
Found 2 hits for monomerid = 50303145
TargetProstaglandin G/H synthase 2(Ovis aries (Sheep))
Universidad Nacional De Colombia
Curated by ChEMBL
LigandPNGBDBM50303145(2'-epi-guianin | CHEMBL570978)
Affinity DataIC50:  3.26E+5nM. Assay description: Inhibition of ovine COX-2 assessed as inhibition of transformation of AA to PGH2 by EIA
In DepthDetails ArticlePubMed
TargetProstaglandin G/H synthase 1(Ovis aries (Sheep))
Universidad Nacional De Colombia
Curated by ChEMBL
LigandPNGBDBM50303145(2'-epi-guianin | CHEMBL570978)
Affinity DataIC50:  1.82E+4nM. Assay description: Inhibition of ovine COX-1 assessed as inhibition of transformation of AA to PGH2 by EIA
In DepthDetails ArticlePubMed