BDBM50303155 (+)-Denudatin B::CHEMBL571196
SMILES COc1ccc(cc1OC)[C@@H]1OC2=CC(=O)C(CC=C)=C[C@@]2(OC)[C@@H]1C
InChI Key InChIKey=VDYACOATPFOZIO-OBVPDXSSSA-N
Data  2 IC50
  Tab Delimited (TSV)   2D SDfile   Computed 3D by Vconf -m prep SDfile
Find this compound or compounds like it in BindingDB:
Activity Spreadsheet -- Enzyme Inhibition Constant Data from BindingDB
Found 2 hits for monomerid = 50303155
TargetProstaglandin G/H synthase 2(Ovis aries (Sheep))
Universidad Nacional De Colombia
Curated by ChEMBL
LigandPNGBDBM50303155((+)-Denudatin B | CHEMBL571196)
Affinity DataIC50:  4.46E+5nM. Assay description: Inhibition of ovine COX-2 assessed as inhibition of transformation of AA to PGH2 by EIA
In DepthDetails ArticlePubMed
TargetProstaglandin G/H synthase 1(Ovis aries (Sheep))
Universidad Nacional De Colombia
Curated by ChEMBL
LigandPNGBDBM50303155((+)-Denudatin B | CHEMBL571196)
Affinity DataIC50:  8.86E+4nM. Assay description: Inhibition of ovine COX-1 assessed as inhibition of transformation of AA to PGH2 by EIA
In DepthDetails ArticlePubMed