BDBM50303355 3,3-Diethyl-1-o-tolylazetidine-2,4-dione::CHEMBL566918
SMILES CCC1(CC)C(=O)N(C1=O)c1ccccc1C
InChI Key InChIKey=QNAKQLGCEYBHNC-UHFFFAOYSA-N
Data  1 KI
  Tab Delimited (TSV)   2D SDfile   Computed 3D by Vconf -m prep SDfile
Find this compound or compounds like it in BindingDB:
Activity Spreadsheet -- Enzyme Inhibition Constant Data from BindingDB
Found 1 hit for monomerid = 50303355
TargetNeutrophil elastase(Homo sapiens (Human))
University Of Lisbon
Curated by ChEMBL
LigandPNGBDBM50303355(3,3-Diethyl-1-o-tolylazetidine-2,4-dione | CHEMBL5...)
Affinity DataKi:  233nM. Assay description: Inhibition of human leukocyte elastase after 20 mins
In DepthDetails ArticlePubMed