BDBM50303378 4-bromo-N'-(3-((4-chloro-1H-pyrazol-1-yl)methyl)-4-methoxybenzylidene)benzohydrazide::CHEMBL579075
SMILES COc1ccc(\C=N\NC(=O)c2ccc(Br)cc2)cc1Cn1cc(Cl)cn1
InChI Key InChIKey=IDENMZZQOVIJOU-LSFURLLWSA-N
Data  1 IC50
  Tab Delimited (TSV)   2D SDfile   Computed 3D by Vconf -m prep SDfile
Find this compound or compounds like it in BindingDB:
Activity Spreadsheet -- Enzyme Inhibition Constant Data from BindingDB
Found 1 hit for monomerid = 50303378
TargetCruzipain(Trypanosoma cruzi)
National Human Genome Research Institute
Curated by ChEMBL
LigandPNGBDBM50303378(4-bromo-N'-(3-((4-chloro-1H-pyrazol-1-yl)methyl)-4...)
Affinity DataIC50:  1.20E+4nM. Assay description: Inhibition of Tryapanosom cruzi cruzain by Flexstation microplate spectrofluorometry
In DepthDetails ArticlePubMed