BDBM50303581 (trans-4-Ethylcyclohexyl)(1-(2-morpholinoethyl)-1H-indol-3-yl)-methanone::CHEMBL584738
SMILES CC[C@H]1CC[C@@H](CC1)C(=O)c1cn(CCN2CCOCC2)c2ccccc12
InChI Key InChIKey=FJDXEYUKDXDFBU-WGSAOQKQSA-N
Data  4 KI  1 EC50
  Tab Delimited (TSV)   2D SDfile   Computed 3D by Vconf -m prep SDfile
Find this compound or compounds like it in BindingDB:
Activity Spreadsheet -- Enzyme Inhibition Constant Data from BindingDB
Found 5 hits for monomerid = 50303581
TargetCannabinoid receptor 2(Homo sapiens (Human))
Abbott Laboratories
Curated by ChEMBL
LigandPNGBDBM50303581((trans-4-Ethylcyclohexyl)(1-(2-morpholinoethyl)-1H...)
Affinity DataKi:  16nM. Assay description: Displacement of [3H]CP-55940 from human recombinant CB2 receptor expressed in HEK293 cells
In DepthDetails ArticlePubMed
TargetCannabinoid receptor 2(Homo sapiens (Human))
Abbott Laboratories
Curated by ChEMBL
LigandPNGBDBM50303581((trans-4-Ethylcyclohexyl)(1-(2-morpholinoethyl)-1H...)
Affinity DataKi:  16nM. Assay description: Displacement of [3H]CP 55940 from human CB2 receptor in cell free system
In DepthDetails ArticlePubMed
TargetCannabinoid receptor 1(Homo sapiens (Human))
Universit£
Curated by ChEMBL
LigandPNGBDBM50303581((trans-4-Ethylcyclohexyl)(1-(2-morpholinoethyl)-1H...)
Affinity DataKi:  616nM. Assay description: Displacement of [3H]CP 55940 from human CB1 receptor in cell free system
In DepthDetails ArticlePubMed
TargetCannabinoid receptor 1(Homo sapiens (Human))
Universit£
Curated by ChEMBL
LigandPNGBDBM50303581((trans-4-Ethylcyclohexyl)(1-(2-morpholinoethyl)-1H...)
Affinity DataKi:  616nM. Assay description: Displacement of [3H]CP-55940 from human recombinant CB1 receptor expressed in CHO cells
In DepthDetails ArticlePubMed
TargetCannabinoid receptor 2(Homo sapiens (Human))
Abbott Laboratories
Curated by ChEMBL
LigandPNGBDBM50303581((trans-4-Ethylcyclohexyl)(1-(2-morpholinoethyl)-1H...)
Affinity DataEC50:  85nM. Assay description: Agonist activity at human recombinant CB2 receptor expressed in HEK293 cells coexpressing Galphaq/o5 assessed as calcium mobilization by FLIPR assay
In DepthDetails ArticlePubMed