BDBM50303840 4-Chloro-N-{[3-(4-chlorophenyl)-4-phenyl-4,5-dihydro-1H-pyrazolyl]-[7-(1,2,3,4-tetrahydroacridin-9-ylamino)heptylamino]-methylene}benzenesulfonamide::CHEMBL570158
SMILES Clc1ccc(cc1)C1=NN(CC1c1ccccc1)C(NS(=O)(=O)c1ccc(Cl)cc1)=NCCCCCCCNc1c2CCCCc2nc2ccccc12
InChI Key InChIKey=REGUYCWTBDAZDP-UHFFFAOYSA-N
Data  2 KI
  Tab Delimited (TSV)   2D SDfile   Computed 3D by Vconf -m prep SDfile
Find this compound or compounds like it in BindingDB:
Activity Spreadsheet -- Enzyme Inhibition Constant Data from BindingDB
Found 2 hits for monomerid = 50303840
TargetCannabinoid receptor 1(Homo sapiens (Human))
Solvay Pharma
Curated by ChEMBL
LigandPNGBDBM50303840(4-Chloro-N-{[3-(4-chlorophenyl)-4-phenyl-4,5-dihyd...)
Affinity DataKi:  54nM. Assay description: Displacement of [3H]CP55940 from human CB1 receptor expressed in CHO cells
In DepthDetails ArticlePubMed
TargetCannabinoid receptor 2(Homo sapiens (Human))
Solvay Pharma
Curated by ChEMBL
LigandPNGBDBM50303840(4-Chloro-N-{[3-(4-chlorophenyl)-4-phenyl-4,5-dihyd...)
Affinity DataKi: >1.00E+3nM. Assay description: Displacement of [3H]CP55940 from human CB2 receptor expressed in CHO cells
In DepthDetails ArticlePubMed