BDBM50303977 3-(4-(2-(1,7'-Dimethyl-2'-propyl-1H,3'H-2,5'-bibenzo[d]imidazol-3'-yl)ethoxy)-phenyl)-2-methyl-2-phenoxypropanoic acid::CHEMBL572276
SMILES CCCc1nc2c(C)cc(cc2n1CCOc1ccc(CC(C)(Oc2ccccc2)C(O)=O)cc1)-c1nc2ccccc2n1C
InChI Key InChIKey=SPTWGXGKKOOKGJ-UHFFFAOYSA-N
Data  1 KI
  Tab Delimited (TSV)   2D SDfile   Computed 3D by Vconf -m prep SDfile
Find this compound or compounds like it in BindingDB:
Activity Spreadsheet -- Enzyme Inhibition Constant Data from BindingDB
Found 1 hit for monomerid = 50303977
TargetType-1 angiotensin II receptor A(RAT)
The University Of Mississippi
Curated by ChEMBL
LigandPNGBDBM50303977(3-(4-(2-(1,7'-Dimethyl-2'-propyl-1H,3'H-2,5'-biben...)
Affinity DataKi:  2.23E+3nM. Assay description: Displacement of [125I]SI-Ang2 from AT1 receptor in Sprague-Dawley rat liver membrane
In DepthDetails ArticlePubMed