BDBM50304044 CHEMBL594703::[({[(2R,3R,4S,5S,6S)-6-[(2-{[(tert-butoxy)carbonyl]amino}ethyl)carbamoyl]-3,4,5-trihydroxyoxan-2-yl]oxy}(hydroxy)phosphoryl)oxy]({[(2R,3S,4R,5R)-5-(2,4-dioxo-1,2,3,4-tetrahydropyrimidin-1-yl)-3,4-dihydroxyoxolan-2-yl]methoxy})phosphinic acid
SMILES CC(C)(C)OC(=O)NCCNC(=O)[C@H]1O[C@H](OP(O)(=O)OP(O)(=O)OC[C@H]2O[C@H]([C@H](O)[C@@H]2O)n2ccc(=O)[nH]c2=O)[C@H](O)[C@@H](O)[C@@H]1O
InChI Key InChIKey=DUQNIUZYFQKFRA-HSIGMSJXSA-N
Data  1 EC50
  Tab Delimited (TSV)   2D SDfile   Computed 3D by Vconf -m prep SDfile
Find this compound or compounds like it in BindingDB:
Activity Spreadsheet -- Enzyme Inhibition Constant Data from BindingDB
Found 1 hit for monomerid = 50304044
TargetP2Y purinoceptor 14(Homo sapiens (Human))
National Institute Of Diabetes And Digestive And Kidney Diseases
Curated by ChEMBL
LigandPNGBDBM50304044(CHEMBL594703 | [({[(2R,3R,4S,5S,6S)-6-[(2-{[(tert-...)
Affinity DataEC50:  951nM. Assay description: Agonist activity at human P2Y14 receptor expressed in human COS7 cells
In DepthDetails ArticlePubMed