BDBM50304093 (S)-2-AMINO-3-(5-TERT-BUTYL-3-(PHOSPHONOMETHOXY)-4-ISOXAZOLYL)PROPIONIC ACID::(S)-2-amino-3-[5-tertbutyl-3-(phosphono-methoxy)-4-isoxazolyl]-propionic acid::CHEMBL594840
SMILES CC(C)(C)c1onc(OCP(O)(O)=O)c1C[C@H](N)C(O)=O
InChI Key InChIKey=AGSOOCUNMTYPSE-ZETCQYMHSA-N
Data  2 KI
PDB links: 2 PDB IDs match this monomer.
  Tab Delimited (TSV)   2D SDfile   Computed 3D by Vconf -m prep SDfile
Find this compound or compounds like it in BindingDB:
Activity Spreadsheet -- Enzyme Inhibition Constant Data from BindingDB
Found 2 hits for monomerid = 50304093
TargetGlutamate receptor ionotropic, kainate 1(RAT)
University Of Copenhagen
Curated by ChEMBL
LigandPNGBDBM50304093((S)-2-AMINO-3-(5-TERT-BUTYL-3-(PHOSPHONOMETHOXY)-4...)
Affinity DataKi:  2.90E+3nM. Assay description: Displacement of [3H]SYM2081 from rat recombinant iGluR5-1b expressed in baculovirus-infected insect Sf9 cells
TargetGlutamate receptor ionotropic, kainate 3(Rattus norvegicus)
Jagiellonian University Medical College
Curated by ChEMBL
LigandPNGBDBM50304093((S)-2-AMINO-3-(5-TERT-BUTYL-3-(PHOSPHONOMETHOXY)-4...)
Affinity DataKi: >1.00E+6nM. Assay description: Displacement of [3H]-kainate from rat recombinant GluK3 receptor expressed in baculovirus infected insect Sf9 cell membranes after 60 mins
In DepthDetails ArticlePubMed