BDBM50304132 1,12-Bis(4'-isohexylpyridinium)dodecane dichloride::CHEMBL593961
SMILES CC(C)CCCc1cc[n+](CCCCCCCCCCCC[n+]2ccc(CCCC(C)C)cc2)cc1
InChI Key InChIKey=YMJJPDNMYLJBIZ-UHFFFAOYSA-N
Data  1 IC50
  Tab Delimited (TSV)   2D SDfile   Computed 3D by Vconf -m prep SDfile
Find this compound or compounds like it in BindingDB:
Activity Spreadsheet -- Enzyme Inhibition Constant Data from BindingDB
Found 1 hit for monomerid = 50304132
TargetPhospholipase A2, major isoenzyme(Sus scrofa (pig))
The University Of Sydney
Curated by ChEMBL
LigandPNGBDBM50304132(1,12-Bis(4'-isohexylpyridinium)dodecane dichloride...)
Affinity DataIC50: >2.50E+5nM. Assay description: Inhibition of porcine pancreatic PLA2 after 1 hr by radiometric method
In DepthDetails ArticlePubMed