BDBM50304136 1,12-Bis(3',4'-dipentylpyridinium)dodecane dichloride::CHEMBL595541
SMILES CCCCCc1cc[n+](CCCCCCCCCCCC[n+]2ccc(CCCCC)c(CCCCC)c2)cc1CCCCC
InChI Key InChIKey=CLUXPDCCEYHEPJ-UHFFFAOYSA-N
Data  1 IC50
  Tab Delimited (TSV)   2D SDfile   Computed 3D by Vconf -m prep SDfile
Find this compound or compounds like it in BindingDB:
Activity Spreadsheet -- Enzyme Inhibition Constant Data from BindingDB
Found 1 hit for monomerid = 50304136
TargetPhospholipase A2, major isoenzyme(Sus scrofa (pig))
The University Of Sydney
Curated by ChEMBL
LigandPNGBDBM50304136(1,12-Bis(3',4'-dipentylpyridinium)dodecane dichlor...)
Affinity DataIC50:  5.20E+4nM. Assay description: Inhibition of porcine pancreatic PLA2 after 1 hr by radiometric method
In DepthDetails ArticlePubMed