BDBM50304145 3-chloro-6-nitro-1H-indazole::CHEMBL596229
SMILES [O-][N+](=O)c1ccc2c(Cl)n[nH]c2c1
InChI Key InChIKey=IBTQINLHMGQUJU-UHFFFAOYSA-N
Data  1 IC50
  Tab Delimited (TSV)   2D SDfile   Computed 3D by Vconf -m prep SDfile
Find this compound or compounds like it in BindingDB:
Activity Spreadsheet -- Enzyme Inhibition Constant Data from BindingDB
Found 1 hit for monomerid = 50304145
TargetNitric oxide synthase, brain(Homo sapiens (Human))
Uned
Curated by ChEMBL
LigandPNGBDBM50304145(3-chloro-6-nitro-1H-indazole | CHEMBL596229)
Affinity DataIC50:  1.58E+5nM. Assay description: Inhibition of NOS1
In DepthDetails ArticlePubMed