BDBM50304324 (1R,9R)-1-{[1-(3,5-Dimethoxy-phenyl)-methylidene]-amino}-13-eth-(E)-ylidene-11-methyl-6-aza-tricyclo[7.3.1.0*2,7*]trideca-2(7),3,10-trien-5-one::CHEMBL606348
SMILES COc1cc(OC)cc(\C=N\[C@@]23CC(C)=C[C@@H](Cc4[nH]c(=O)ccc24)\C3=C/C)c1
InChI Key InChIKey=LONUDFBKFFIIBJ-GACPZTKFSA-N
Data  2 IC50
  Tab Delimited (TSV)   2D SDfile   Computed 3D by Vconf -m prep SDfile
Find this compound or compounds like it in BindingDB:
Activity Spreadsheet -- Enzyme Inhibition Constant Data from BindingDB
Found 2 hits for monomerid = 50304324
TargetAcetylcholinesterase(Homo sapiens (Human))
The Chinese Academy Of Sciences
Curated by ChEMBL
LigandPNGBDBM50304324((1R,9R)-1-{[1-(3,5-Dimethoxy-phenyl)-methylidene]-...)
Affinity DataIC50:  29nM. Assay description: Inhibition of human AChE by Ellman's method
In DepthDetails ArticlePubMed
TargetAcetylcholinesterase(Tetronarce californica (Pacific electric ray) (Tor...)
The Chinese Academy Of Sciences
Curated by ChEMBL
LigandPNGBDBM50304324((1R,9R)-1-{[1-(3,5-Dimethoxy-phenyl)-methylidene]-...)
Affinity DataIC50:  0.0200nM. Assay description: Inhibition of Torpedo california AChE by Ellman's method
In DepthDetails ArticlePubMed