BDBM50304512 6-(4-methylpiperazin-1-yl)-9Hpurine::CHEMBL594152
SMILES CN1CCN(CC1)c1ncnc2nc[nH]c12
InChI Key InChIKey=AXPCNBLIEMWMMG-UHFFFAOYSA-N
Data  1 KI
  Tab Delimited (TSV)   2D SDfile   Computed 3D by Vconf -m prep SDfile
Find this compound or compounds like it in BindingDB:
Activity Spreadsheet -- Enzyme Inhibition Constant Data from BindingDB
Found 1 hit for monomerid = 50304512
TargetHistamine H4 receptor(Homo sapiens (Human))
Johann Wolfgang Goethe University
Curated by ChEMBL
LigandPNGBDBM50304512(6-(4-methylpiperazin-1-yl)-9Hpurine | CHEMBL594152)
Affinity DataKi:  1.84E+4nM. Assay description: Displacement of [3H]histamine from human histamine H4 receptor expressed in Sf9 cells co-expressing Galphai2 and Gbeta1gamma2
In DepthDetails ArticlePubMed