BDBM50304522 4-((2-Amino-6-(4-methylpiperazin-1-yl)pyrimidin-4-ylamino)methyl)benzoic acid::CHEMBL594266
SMILES CN1CCN(CC1)c1cc(NCc2ccc(cc2)C(O)=O)nc(N)n1
InChI Key InChIKey=BISUKAQGRPXHOK-UHFFFAOYSA-N
Data  1 KI
  Tab Delimited (TSV)   2D SDfile   Computed 3D by Vconf -m prep SDfile
Find this compound or compounds like it in BindingDB:
Activity Spreadsheet -- Enzyme Inhibition Constant Data from BindingDB
Found 1 hit for monomerid = 50304522
TargetHistamine H4 receptor(Homo sapiens (Human))
Johann Wolfgang Goethe University
Curated by ChEMBL
LigandPNGBDBM50304522(4-((2-Amino-6-(4-methylpiperazin-1-yl)pyrimidin-4-...)
Affinity DataKi:  3.77E+5nM. Assay description: Displacement of [3H]histamine from human histamine H4 receptor expressed in Sf9 cells co-expressing Galphai2 and Gbeta1gamma2
In DepthDetails ArticlePubMed