BDBM50304527 CHEMBL492677::N4-Benzyl-6-(4-methylpiperazin-1-yl)pyrimidine-2,4-diamine
SMILES CN1CCN(CC1)c1cc(NCc2ccccc2)nc(N)n1
InChI Key InChIKey=GXRZHULPUGZJMQ-UHFFFAOYSA-N
Data  2 KI  2 EC50
  Tab Delimited (TSV)   2D SDfile   Computed 3D by Vconf -m prep SDfile
Find this compound or compounds like it in BindingDB:
Activity Spreadsheet -- Enzyme Inhibition Constant Data from BindingDB
Found 4 hits for monomerid = 50304527
TargetHistamine H4 receptor(Homo sapiens (Human))
Johnson & Johnson Pharmaceutical Research & Development
Curated by ChEMBL
LigandPNGBDBM50304527(CHEMBL492677 | N4-Benzyl-6-(4-methylpiperazin-1-yl...)
Affinity DataKi:  20nM. Assay description: Displacement of [3H]histamine from human histamine H4 receptor
In DepthDetails ArticlePubMed
TargetHistamine H4 receptor(Homo sapiens (Human))
Johnson & Johnson Pharmaceutical Research & Development
Curated by ChEMBL
LigandPNGBDBM50304527(CHEMBL492677 | N4-Benzyl-6-(4-methylpiperazin-1-yl...)
Affinity DataKi:  98nM. Assay description: Displacement of [3H]histamine from human histamine H4 receptor expressed in Sf9 cells co-expressing Galphai2 and Gbeta1gamma2
In DepthDetails ArticlePubMed
TargetHistamine H4 receptor(Homo sapiens (Human))
Johnson & Johnson Pharmaceutical Research & Development
Curated by ChEMBL
LigandPNGBDBM50304527(CHEMBL492677 | N4-Benzyl-6-(4-methylpiperazin-1-yl...)
Affinity DataEC50:  63nM. Assay description: Agonist activity at histamine H4 receptor (unknown origin) expressed in human U2OS cells increase in beta-arrestin2 recruitment after 2 hrs by lumine...
In DepthDetails ArticlePubMed
TargetHistamine H4 receptor(Homo sapiens (Human))
Johnson & Johnson Pharmaceutical Research & Development
Curated by ChEMBL
LigandPNGBDBM50304527(CHEMBL492677 | N4-Benzyl-6-(4-methylpiperazin-1-yl...)
Affinity DataEC50:  13nM. Assay description: Agonist activity at histamine H4 receptor (unknown origin) expressed in HEK293T cells harboring CRE-luciferase after 6 hrs by luciferase reporter gen...
In DepthDetails ArticlePubMed