BDBM50305026 (6-(phenylamino)pyridin-3-yl)(piperidin-1-yl)methanone::CHEMBL596139
SMILES O=C(N1CCCCC1)c1ccc(Nc2ccccc2)nc1
InChI Key InChIKey=AYYOBMISYJRENX-UHFFFAOYSA-N
Data  1 IC50
  Tab Delimited (TSV)   2D SDfile   Computed 3D by Vconf -m prep SDfile
Find this compound or compounds like it in BindingDB:
Activity Spreadsheet -- Enzyme Inhibition Constant Data from BindingDB
Found 1 hit for monomerid = 50305026
TargetMetabotropic glutamate receptor 5(Homo sapiens (Human))
Novartis Institutes For Biomedical Research
Curated by ChEMBL
LigandPNGBDBM50305026((6-(phenylamino)pyridin-3-yl)(piperidin-1-yl)metha...)
Affinity DataIC50:  1.00E+4nM. Assay description: Antagonist activity at human mGluR5 assessed as inhibition of glutamate-induced elevation of intracellular calcium concentration
In DepthDetails ArticlePubMed