BDBM50305032 (6-(4-methoxyphenylamino)pyridin-3-yl)(piperidin-1-yl)methanone::CHEMBL593362
SMILES COc1ccc(Nc2ccc(cn2)C(=O)N2CCCCC2)cc1
InChI Key InChIKey=MOWRNYHKJAZJGB-UHFFFAOYSA-N
Data  1 IC50
  Tab Delimited (TSV)   2D SDfile   Computed 3D by Vconf -m prep SDfile
Find this compound or compounds like it in BindingDB:
Activity Spreadsheet -- Enzyme Inhibition Constant Data from BindingDB
Found 1 hit for monomerid = 50305032
TargetMetabotropic glutamate receptor 5(Homo sapiens (Human))
Novartis Institutes For Biomedical Research
Curated by ChEMBL
LigandPNGBDBM50305032((6-(4-methoxyphenylamino)pyridin-3-yl)(piperidin-1...)
Affinity DataIC50:  1.80E+3nM. Assay description: Antagonist activity at human mGluR5 assessed as inhibition of glutamate-induced elevation of intracellular calcium concentration
In DepthDetails ArticlePubMed