BDBM50305050 (S)-(5-chloro-6-(6-methylpyridin-3-ylamino)pyridin-3-yl)(2-methylpiperidin-1-yl)methanone::CHEMBL594781
SMILES C[C@H]1CCCCN1C(=O)c1cnc(Nc2ccc(C)nc2)c(Cl)c1
InChI Key InChIKey=QNYQRZYDZSRQND-ZDUSSCGKSA-N
Data  1 IC50
  Tab Delimited (TSV)   2D SDfile   Computed 3D by Vconf -m prep SDfile
Find this compound or compounds like it in BindingDB:
Activity Spreadsheet -- Enzyme Inhibition Constant Data from BindingDB
Found 1 hit for monomerid = 50305050
TargetMetabotropic glutamate receptor 5(Homo sapiens (Human))
Novartis Institutes For Biomedical Research
Curated by ChEMBL
LigandPNGBDBM50305050((S)-(5-chloro-6-(6-methylpyridin-3-ylamino)pyridin...)
Affinity DataIC50:  1.40E+3nM. Assay description: Antagonist activity at human mGluR5 assessed as inhibition of glutamate-induced elevation of intracellular calcium concentration
In DepthDetails ArticlePubMed