BDBM50305219 (+/-)-3-amino-1-(1-(3-hydroxyphenyl)-3,4-dihydro-1H-pyrido[3,4-b]indol-2(9H)-yl)propan-1-one::CHEMBL590607
SMILES NCCC(=O)N1CCc2c([nH]c3ccccc23)C1c1cccc(O)c1
InChI Key InChIKey=ZGLFKBXFGLFUGJ-UHFFFAOYSA-N
Data  1 IC50
  Tab Delimited (TSV)   2D SDfile   Computed 3D by Vconf -m prep SDfile
Find this compound or compounds like it in BindingDB:
Activity Spreadsheet -- Enzyme Inhibition Constant Data from BindingDB
Found 1 hit for monomerid = 50305219
TargetKinesin-like protein KIF11(Homo sapiens (Human))
Novartis Institutes For Biomedical Research
Curated by ChEMBL
LigandPNGBDBM50305219((+/-)-3-amino-1-(1-(3-hydroxyphenyl)-3,4-dihydro-1...)
Affinity DataIC50:  630nM. Assay description: Inhibition of EG5 after 2 hrs
In DepthDetails ArticlePubMed