BDBM50305270 2,8-Dimethyl-5-[2-(4-trifluoromethylphenyl)ethyl]-2,3,4,5-tetrahydro-1H-pyrido[4,3-b]indole::CHEMBL606036
SMILES CN1CCc2c(C1)c1cc(C)ccc1n2CCc1ccc(cc1)C(F)(F)F
InChI Key InChIKey=FCDNLGMRDAOTCR-UHFFFAOYSA-N
Data  2 IC50
  Tab Delimited (TSV)   2D SDfile   Computed 3D by Vconf -m prep SDfile
Find this compound or compounds like it in BindingDB:
Activity Spreadsheet -- Enzyme Inhibition Constant Data from BindingDB
Found 2 hits for monomerid = 50305270
Target5-hydroxytryptamine receptor 6(Homo sapiens (Human))
Chemical Diversity Research Institute
Curated by ChEMBL
LigandPNGBDBM50305270(2,8-Dimethyl-5-[2-(4-trifluoromethylphenyl)ethyl]-...)
Affinity DataIC50:  4.07E+3nM. Assay description: Antagonist activity at human recombinant 5HT6 receptor expressed in HEK-293 cells assessed as inhibition of serotonin-induced increase in intracellul...
In DepthDetails ArticlePubMed
TargetHistamine H1 receptor(Homo sapiens (Human))
Chemical Diversity Research Institute
Curated by ChEMBL
LigandPNGBDBM50305270(2,8-Dimethyl-5-[2-(4-trifluoromethylphenyl)ethyl]-...)
Affinity DataIC50:  98nM. Assay description: Antagonist activity at histamine H1 receptor in human SK-N-SH cells assessed as histamine-induced maximum intracellular calcium spike at phase 1 trea...
In DepthDetails ArticlePubMed