BDBM50305438 2-(1-(2-chlorophenyl)-5-(4-chlorophenyl)-3-(7-(trifluoromethyl)-1,2,3,4-tetrahydroisoquinoline-2-carbonyl)-1H-pyrazol-4-yl)acetonitrile::CHEMBL589649
SMILES FC(F)(F)c1ccc2CCN(Cc2c1)C(=O)c1nn(c(c1CC#N)-c1ccc(Cl)cc1)-c1ccccc1Cl
InChI Key InChIKey=OAQQRLGMKZEVFV-UHFFFAOYSA-N
Data  1 IC50
  Tab Delimited (TSV)   2D SDfile   Computed 3D by Vconf -m prep SDfile
Find this compound or compounds like it in BindingDB:
Activity Spreadsheet -- Enzyme Inhibition Constant Data from BindingDB
Found 1 hit for monomerid = 50305438
TargetCannabinoid receptor 1(Homo sapiens (Human))
7Tm Pharma
Curated by ChEMBL
LigandPNGBDBM50305438(2-(1-(2-chlorophenyl)-5-(4-chlorophenyl)-3-(7-(tri...)
Affinity DataIC50:  2.10nM. Assay description: Antagonist activity at human recombinant CB1 receptor expressed in CHO-K1 cells assessed as inhibition of CP55940-stimulated GTPgammaS binding
In DepthDetails ArticlePubMed