BDBM50305483 2-amino-4,4-dicyclohexyl-1-methyl-1H-imidazol-5(4H)-one::CHEMBL589163
SMILES CN1C(N)=NC(C2CCCCC2)(C2CCCCC2)C1=O
InChI Key InChIKey=IAMIFCZOYVOTFD-UHFFFAOYSA-N
Data  2 IC50  1 EC50
  Tab Delimited (TSV)   2D SDfile   Computed 3D by Vconf -m prep SDfile
Find this compound or compounds like it in BindingDB:
Activity Spreadsheet -- Enzyme Inhibition Constant Data from BindingDB
Found 3 hits for monomerid = 50305483
TargetBeta-secretase 1(Homo sapiens (Human))
Wyeth Research
Curated by ChEMBL
LigandPNGBDBM50305483(2-amino-4,4-dicyclohexyl-1-methyl-1H-imidazol-5(4H...)
Affinity DataIC50:  1.08E+3nM. Assay description: Inhibition of human BACE1 by FRET assay
In DepthDetails ArticlePubMed
TargetBeta-secretase 2(Homo sapiens (Human))
Wyeth Research
Curated by ChEMBL
LigandPNGBDBM50305483(2-amino-4,4-dicyclohexyl-1-methyl-1H-imidazol-5(4H...)
Affinity DataIC50:  510nM. Assay description: Inhibition of human BACE2 by FRET assay
In DepthDetails ArticlePubMed
TargetAmyloid-beta precursor protein(Homo sapiens (Human))
Wyeth Research
Curated by ChEMBL
LigandPNGBDBM50305483(2-amino-4,4-dicyclohexyl-1-methyl-1H-imidazol-5(4H...)
Affinity DataEC50:  1.03E+3nM. Assay description: Inhibition of human recombinant APP expressed in CHO-K1 cells assessed as reduction of amyloid beta level by ELISA
In DepthDetails ArticlePubMed