BDBM50305772 5-(6-(4-(2-(trifluoromethyl)phenoxy)piperidin-1-yl)pyridazin-3-yl)-1,3,4-thiadiazol-2-ol::CHEMBL593519
SMILES FC(F)(F)c1ccccc1OC1CCN(CC1)c1ccc(nn1)-c1n[nH]c(=O)s1
InChI Key InChIKey=VDMFECAVHOPWSU-UHFFFAOYSA-N
Data  1 IC50
  Tab Delimited (TSV)   2D SDfile   Computed 3D by Vconf -m prep SDfile
Find this compound or compounds like it in BindingDB:
Activity Spreadsheet -- Enzyme Inhibition Constant Data from BindingDB
Found 1 hit for monomerid = 50305772
TargetAcyl-CoA desaturase 1(Rattus norvegicus (Rat))
Merck Frosst Centre For Therapeutic Research
Curated by ChEMBL
LigandPNGBDBM50305772(5-(6-(4-(2-(trifluoromethyl)phenoxy)piperidin-1-yl...)
Affinity DataIC50:  6.10nM. Assay description: Inhibition of SCD1 in rat liver microsomes
In DepthDetails ArticlePubMed