BDBM50305773 (5-(6-(4-(2-(trifluoromethyl)phenoxy)piperidin-1-yl)pyridazin-3-yl)-1,3,4-thiadiazol-2-yl)methanol::CHEMBL610737
SMILES OCc1nnc(s1)-c1ccc(nn1)N1CCC(CC1)Oc1ccccc1C(F)(F)F
InChI Key InChIKey=YOAJCQYXRYKXPP-UHFFFAOYSA-N
Data  1 IC50
  Tab Delimited (TSV)   2D SDfile   Computed 3D by Vconf -m prep SDfile
Find this compound or compounds like it in BindingDB:
Activity Spreadsheet -- Enzyme Inhibition Constant Data from BindingDB
Found 1 hit for monomerid = 50305773
TargetAcyl-CoA desaturase 1(Rattus norvegicus (Rat))
Merck Frosst Centre For Therapeutic Research
Curated by ChEMBL
LigandPNGBDBM50305773((5-(6-(4-(2-(trifluoromethyl)phenoxy)piperidin-1-y...)
Affinity DataIC50:  3.20nM. Assay description: Inhibition of SCD1 in rat liver microsomes
In DepthDetails ArticlePubMed