BDBM50305802 3-(benzo[d][1,3]dioxol-5-yl)-4-phenylfuran-2,5-dione::CHEMBL603434
SMILES O=C1OC(=O)C(=C1c1ccccc1)c1ccc2OCOc2c1
InChI Key InChIKey=IMHGOAWBSJVILI-UHFFFAOYSA-N
Data  1 IC50
  Tab Delimited (TSV)   2D SDfile   Computed 3D by Vconf -m prep SDfile
Find this compound or compounds like it in BindingDB:
Activity Spreadsheet -- Enzyme Inhibition Constant Data from BindingDB
Found 1 hit for monomerid = 50305802
TargetProstaglandin G/H synthase 2(Homo sapiens (Human))
Kyung Hee University
Curated by ChEMBL
LigandPNGBDBM50305802(3-(benzo[d][1,3]dioxol-5-yl)-4-phenylfuran-2,5-dio...)
Affinity DataIC50:  1.85E+4nM. Assay description: Inhibition of COX2 assessed as PGF2alpha level by EIA
In DepthDetails ArticlePubMed