BDBM50305827 4-((3-(2-(3-methoxybenzyl)-2H-tetrazol-5-yl)benzamido)methyl)benzoic acid::CHEMBL593983
SMILES COc1cccc(Cn2nnc(n2)-c2cccc(c2)C(=O)NCc2ccc(cc2)C(O)=O)c1
InChI Key InChIKey=IPXYUVOQPGOREM-UHFFFAOYSA-N
Data  2 IC50
  Tab Delimited (TSV)   2D SDfile   Computed 3D by Vconf -m prep SDfile
Find this compound or compounds like it in BindingDB:
Activity Spreadsheet -- Enzyme Inhibition Constant Data from BindingDB
Found 2 hits for monomerid = 50305827
TargetCollagenase 3(Homo sapiens (Human))
Pfizer
Curated by ChEMBL
LigandPNGBDBM50305827(4-((3-(2-(3-methoxybenzyl)-2H-tetrazol-5-yl)benzam...)
Affinity DataIC50:  530nM. Assay description: Inhibition of human recombinant full length MMP13 assessed as type 3 collagen cleavage activity after 18 hrs
In DepthDetails ArticlePubMed
TargetCollagenase 3(Homo sapiens (Human))
Pfizer
Curated by ChEMBL
LigandPNGBDBM50305827(4-((3-(2-(3-methoxybenzyl)-2H-tetrazol-5-yl)benzam...)
Affinity DataIC50:  38nM. Assay description: Inhibition of human recombinant MMP13 catalytic domain
In DepthDetails ArticlePubMed