BDBM50305841 CHEMBL605201::N1,N3-bis(3-methoxybenzyl)isophthalamide
SMILES COc1cccc(CNC(=O)c2cccc(c2)C(=O)NCc2cccc(OC)c2)c1
InChI Key InChIKey=XDBOLPFDJWTESQ-UHFFFAOYSA-N
Data  7 IC50
  Tab Delimited (TSV)   2D SDfile   Computed 3D by Vconf -m prep SDfile
Find this compound or compounds like it in BindingDB:
Activity Spreadsheet -- Enzyme Inhibition Constant Data from BindingDB
Found 7 hits for monomerid = 50305841
TargetMatrix metalloproteinase-9(Homo sapiens (Human))
Pfizer
Curated by ChEMBL
LigandPNGBDBM50305841(CHEMBL605201 | N1,N3-bis(3-methoxybenzyl)isophthal...)
Affinity DataIC50: >1.00E+5nM. Assay description: Inhibition of MMP9
In DepthDetails ArticlePubMed
TargetMatrix metalloproteinase-14(Homo sapiens (Human))
Pfizer
Curated by ChEMBL
LigandPNGBDBM50305841(CHEMBL605201 | N1,N3-bis(3-methoxybenzyl)isophthal...)
Affinity DataIC50: >1.00E+5nM. Assay description: Inhibition of MMP14
In DepthDetails ArticlePubMed
TargetInterstitial collagenase(Homo sapiens (Human))
Pfizer
Curated by ChEMBL
LigandPNGBDBM50305841(CHEMBL605201 | N1,N3-bis(3-methoxybenzyl)isophthal...)
Affinity DataIC50: >1.00E+5nM. Assay description: Inhibition of MMP1
In DepthDetails ArticlePubMed
TargetCollagenase 3(Homo sapiens (Human))
Pfizer
Curated by ChEMBL
LigandPNGBDBM50305841(CHEMBL605201 | N1,N3-bis(3-methoxybenzyl)isophthal...)
Affinity DataIC50:  1.35E+3nM. Assay description: Inhibition of human recombinant full length MMP13 assessed as type 3 collagen cleavage activity after 18 hrs
In DepthDetails ArticlePubMed
TargetStromelysin-1(Homo sapiens (Human))
Pfizer
Curated by ChEMBL
LigandPNGBDBM50305841(CHEMBL605201 | N1,N3-bis(3-methoxybenzyl)isophthal...)
Affinity DataIC50: >1.00E+5nM. Assay description: Inhibition of MMP3
In DepthDetails ArticlePubMed
TargetMatrilysin(Homo sapiens (Human))
Pfizer
Curated by ChEMBL
LigandPNGBDBM50305841(CHEMBL605201 | N1,N3-bis(3-methoxybenzyl)isophthal...)
Affinity DataIC50: >1.00E+5nM. Assay description: Inhibition of MMP7
In DepthDetails ArticlePubMed
Target72 kDa type IV collagenase(Homo sapiens (Human))
Pfizer
Curated by ChEMBL
LigandPNGBDBM50305841(CHEMBL605201 | N1,N3-bis(3-methoxybenzyl)isophthal...)
Affinity DataIC50: >1.00E+5nM. Assay description: Inhibition of MMP2
In DepthDetails ArticlePubMed