BDBM50305925 (S)-2-(4-chlorophenyl)-4-methoxy-N-(thiazol-2-yl)butanamide::CHEMBL594597
SMILES COCC[C@H](C(=O)Nc1nccs1)c1ccc(Cl)cc1
InChI Key InChIKey=FRVUAPNBUCXRLI-LBPRGKRZSA-N
Data  1 IC50
  Tab Delimited (TSV)   2D SDfile   Computed 3D by Vconf -m prep SDfile
Find this compound or compounds like it in BindingDB:
Activity Spreadsheet -- Enzyme Inhibition Constant Data from BindingDB
Found 1 hit for monomerid = 50305925
TargetFree fatty acid receptor 2(Homo sapiens (Human))
Amgen
Curated by ChEMBL
LigandPNGBDBM50305925((S)-2-(4-chlorophenyl)-4-methoxy-N-(thiazol-2-yl)b...)
Affinity DataIC50:  1.70E+5nM. Assay description: Agonist activity at human FFA2 receptor expressed in CHO cells assessed as inhibition of forskolin-induced cAMP production
In DepthDetails ArticlePubMed