BDBM50306155 3-((S)-2-amino-3-(1H-indol-3-yl)propoxy)-5-(3-methyl-1H-indazol-5-yl)-6-(2-methylfuran-3-yl)pyridin-2-amine::CHEMBL593374
SMILES Cc1n[nH]c2ccc(cc12)-c1cc(OC[C@@H](N)Cc2c[nH]c3ccccc23)c(N)nc1-c1ccoc1C
InChI Key InChIKey=NNIFDNQGXRCFDV-FQEVSTJZSA-N
Data  5 IC50
  Tab Delimited (TSV)   2D SDfile   Computed 3D by Vconf -m prep SDfile
Find this compound or compounds like it in BindingDB:
Activity Spreadsheet -- Enzyme Inhibition Constant Data from BindingDB
Found 5 hits for monomerid = 50306155
TargetRAC-alpha serine/threonine-protein kinase(Homo sapiens (Human))
Glaxosmithkline
Curated by ChEMBL
LigandPNGBDBM50306155(3-((S)-2-amino-3-(1H-indol-3-yl)propoxy)-5-(3-meth...)
Affinity DataIC50:  3nM. Assay description: Inhibition of human AKT1
In DepthDetails ArticlePubMed
TargetRAC-beta serine/threonine-protein kinase(Homo sapiens (Human))
Glaxosmithkline
Curated by ChEMBL
LigandPNGBDBM50306155(3-((S)-2-amino-3-(1H-indol-3-yl)propoxy)-5-(3-meth...)
Affinity DataIC50:  15nM. Assay description: Inhibition of human AKT2
In DepthDetails ArticlePubMed
TargetCytochrome P450 3A4(Homo sapiens (Human))
Glaxosmithkline
Curated by ChEMBL
LigandPNGBDBM50306155(3-((S)-2-amino-3-(1H-indol-3-yl)propoxy)-5-(3-meth...)
Affinity DataIC50:  100nM. Assay description: Inhibition of CYP3A4
In DepthDetails ArticlePubMed
TargetGlycogen synthase kinase-3 beta(Homo sapiens (Human))
Glaxosmithkline
Curated by ChEMBL
LigandPNGBDBM50306155(3-((S)-2-amino-3-(1H-indol-3-yl)propoxy)-5-(3-meth...)
Affinity DataIC50:  220nM. Assay description: Inhibition of GSK2beta phosphorylation in human BT474 cells
In DepthDetails ArticlePubMed
TargetRAC-gamma serine/threonine-protein kinase(Homo sapiens (Human))
Glaxosmithkline
Curated by ChEMBL
LigandPNGBDBM50306155(3-((S)-2-amino-3-(1H-indol-3-yl)propoxy)-5-(3-meth...)
Affinity DataIC50:  1nM. Assay description: Inhibition of human AKT3
In DepthDetails ArticlePubMed