BDBM50306250 4-(2-oxo-2-(7-oxo-2,3,7,8,9,9a-hexahydro-1H-benzo[de][1,7]naphthyridin-1-yl)ethyl)benzonitrile::CHEMBL611621
SMILES O=C(Cc1ccc(cc1)C#N)N1CCc2cccc3C(=O)NCC1c23
InChI Key InChIKey=BFDSPWGICSDYBD-UHFFFAOYSA-N
Data  1 IC50  1 EC50
  Tab Delimited (TSV)   2D SDfile   Computed 3D by Vconf -m prep SDfile
Find this compound or compounds like it in BindingDB:
Activity Spreadsheet -- Enzyme Inhibition Constant Data from BindingDB
Found 2 hits for monomerid = 50306250
TargetPoly [ADP-ribose] polymerase 1(Homo sapiens (Human))
Irbm-Merck Research Laboratories Rome
Curated by ChEMBL
LigandPNGBDBM50306250(4-(2-oxo-2-(7-oxo-2,3,7,8,9,9a-hexahydro-1H-benzo[...)
Affinity DataEC50:  200nM. Assay description: Inhibition of PARP1 in human HeLa cells assessed as inhibition of hydrogen peroxide-induced poly(ADP-ribosyl)ation
In DepthDetails ArticlePubMed
TargetPoly [ADP-ribose] polymerase 1(Homo sapiens (Human))
Irbm-Merck Research Laboratories Rome
Curated by ChEMBL
LigandPNGBDBM50306250(4-(2-oxo-2-(7-oxo-2,3,7,8,9,9a-hexahydro-1H-benzo[...)
Affinity DataIC50:  9nM. Assay description: Inhibition of human PARP1 by scintillation proximity assay
In DepthDetails ArticlePubMed