BDBM50306317 (R)-N-(4-(7-chloro-8-hydroxy-3-methyl-2,3,4,5-tetrahydro-1H-benzo[d]azepin-1-yl)benzyl)-N-methylbenzenesulfonamide::CHEMBL599487
SMILES CN(Cc1ccc(cc1)[C@H]1CN(C)CCc2cc(Cl)c(O)cc12)S(=O)(=O)c1ccccc1
InChI Key InChIKey=FDYARYSVVYXICE-HSZRJFAPSA-N
Data  4 KI
  Tab Delimited (TSV)   2D SDfile   Computed 3D by Vconf -m prep SDfile
Find this compound or compounds like it in BindingDB:
Activity Spreadsheet -- Enzyme Inhibition Constant Data from BindingDB
Found 4 hits for monomerid = 50306317
TargetD(1A) dopamine receptor(Homo sapiens (Human))
Merck Research Laboratories
Curated by ChEMBL
LigandPNGBDBM50306317((R)-N-(4-(7-chloro-8-hydroxy-3-methyl-2,3,4,5-tetr...)
Affinity DataKi:  0.600nM. Assay description: Binding affinity to dopamine D1 receptor
In DepthDetails ArticlePubMed
TargetD(1B) dopamine receptor(Homo sapiens (Human))
Merck Research Laboratories
Curated by ChEMBL
LigandPNGBDBM50306317((R)-N-(4-(7-chloro-8-hydroxy-3-methyl-2,3,4,5-tetr...)
Affinity DataKi:  1.20nM. Assay description: Binding affinity to dopamine D5 receptor
In DepthDetails ArticlePubMed
TargetD(2) dopamine receptor(Homo sapiens (Human))
Merck Research Laboratories
Curated by ChEMBL
LigandPNGBDBM50306317((R)-N-(4-(7-chloro-8-hydroxy-3-methyl-2,3,4,5-tetr...)
Affinity DataKi:  331nM. Assay description: Binding affinity to dopamine D2 receptor
In DepthDetails ArticlePubMed
TargetD(4) dopamine receptor(Homo sapiens (Human))
Merck Research Laboratories
Curated by ChEMBL
LigandPNGBDBM50306317((R)-N-(4-(7-chloro-8-hydroxy-3-methyl-2,3,4,5-tetr...)
Affinity DataKi:  4.33E+3nM. Assay description: Binding affinity to dopamine D4 receptor
In DepthDetails ArticlePubMed