BDBM50306585 (R)-2-(carboxyformamido)-3-(4-(4-fluorophenylsulfonyloxy)phenyl)propanoic acid::CHEMBL602502
SMILES OC(=O)[C@@H](Cc1ccc(OS(=O)(=O)c2ccc(F)cc2)cc1)NC(=O)C(O)=O
InChI Key InChIKey=DRCHYLYUTQUWDZ-CQSZACIVSA-N
Data  2 IC50
  Tab Delimited (TSV)   2D SDfile   Computed 3D by Vconf -m prep SDfile
Find this compound or compounds like it in BindingDB:
Activity Spreadsheet -- Enzyme Inhibition Constant Data from BindingDB
Found 2 hits for monomerid = 50306585
TargetLysine-specific demethylase 4E(Homo sapiens (Human))
University Of Copenhagen
Curated by ChEMBL
LigandPNGBDBM50306585((R)-2-(carboxyformamido)-3-(4-(4-fluorophenylsulfo...)
Affinity DataIC50:  5.00E+3nM. Assay description: Binding affinity to JMJD2E
In DepthDetails ArticlePubMed
TargetLysine-specific demethylase 4A(Homo sapiens (Human))
University Of Oxford
Curated by ChEMBL
LigandPNGBDBM50306585((R)-2-(carboxyformamido)-3-(4-(4-fluorophenylsulfo...)
Affinity DataIC50:  2.00E+4nM. Assay description: Inhibition of JMJD2A by MALDI-TOF assay
In DepthDetails ArticlePubMed