BDBM50306600 3-(4-((S)-1-cyclopentyl-1-(quinolin-6-ylmethylamino)ethyl)-1H-1,2,3-triazol-1-yl)-1-(2,3,5,6-tetrafluorophenoxy)heptan-2-one::CHEMBL592646
SMILES CCCCC(C(=O)COc1c(F)c(F)cc(F)c1F)n1cc(nn1)[C@@](C)(NCc1ccc2ncccc2c1)C1CCCC1
InChI Key InChIKey=XBQOGPRXCCTYMI-AKWYTYQQSA-N
Data  1 KI  2 IC50
  Tab Delimited (TSV)   2D SDfile   Computed 3D by Vconf -m prep SDfile
Find this compound or compounds like it in BindingDB:
Activity Spreadsheet -- Enzyme Inhibition Constant Data from BindingDB
Found 3 hits for monomerid = 50306600
TargetCruzipain(Trypanosoma cruzi)
University Of California
Curated by ChEMBL
LigandPNGBDBM50306600(3-(4-((S)-1-cyclopentyl-1-(quinolin-6-ylmethylamin...)
Affinity DataKi:  110nM. Assay description: Inhibition of Trypanosoma cruzi cruzain
In DepthDetails ArticlePubMed
TargetCruzipain(Trypanosoma cruzi)
University Of California
Curated by ChEMBL
LigandPNGBDBM50306600(3-(4-((S)-1-cyclopentyl-1-(quinolin-6-ylmethylamin...)
Affinity DataIC50:  27nM. Assay description: Inhibition of Trypanosoma cruzi recombinant cruzain using Z-FR-AMC as substrate after 5 mins by fluorescence assay
In DepthDetails ArticlePubMed
TargetCytochrome P450 3A4(Homo sapiens (Human))
University Of California
Curated by ChEMBL
LigandPNGBDBM50306600(3-(4-((S)-1-cyclopentyl-1-(quinolin-6-ylmethylamin...)
Affinity DataIC50:  260nM. Assay description: Inhibition of CYP3A4 (unknown origin)
In DepthDetails ArticlePubMed