BDBM50306745 (3-amino-5-bromobenzofuran-2-yl)(phenyl)methanone::CHEMBL591458
SMILES Nc1c(oc2ccc(Br)cc12)C(=O)c1ccccc1
InChI Key InChIKey=SBFAYONAJFSEPC-UHFFFAOYSA-N
Data  1 KI
  Tab Delimited (TSV)   2D SDfile   Computed 3D by Vconf -m prep SDfile
Find this compound or compounds like it in BindingDB:
Activity Spreadsheet -- Enzyme Inhibition Constant Data from BindingDB
Found 1 hit for monomerid = 50306745
TargetAdenosine receptor A2a(Homo sapiens (Human))
The Scripps Research Institute
Curated by ChEMBL
LigandPNGBDBM50306745((3-amino-5-bromobenzofuran-2-yl)(phenyl)methanone ...)
Affinity DataKi:  2.20E+3nM. Assay description: Inhibition of human adenosine 2A receptor
In DepthDetails ArticlePubMed